[fpc-devel]Compiler error

Bob Martin rvmartin at ntlworld.com
Thu Oct 23 16:35:55 CEST 2003

I have been unable to compile the 1.1 snapshot on OS/2 for the last few days :

make[3]: Entering directory `/FPC/rtl/os2'
as -o prt0.o prt0.as
as -o prt0.oo2 prt0.as
as -o prt1.o prt1.as
as -o prt1.oo2 prt1.as
T:/FPC/COMPILER/ppc1.exe -Fi../inc -Fi../i386 -FE. -FD g:/fpc1010/bin/os2 -Ch52000000 -di386 -Us -Sg system.pas

Process terminated by SIGSEGV
core dumped
make[3]: *** [system.ppu] Segmentation fault
make[3]: Leaving directory `/FPC/rtl/os2'
make[2]: *** [next] Error 2
make[2]: Leaving directory `/FPC/COMPILER'
make[1]: *** [ppc2.exe] Error 2
make[1]: Leaving directory `/FPC/COMPILER'
make: *** [cycle] Error 2

More information about the fpc-devel mailing list