[fpc-pascal] Compilation aborted: sysutils.inc(80, 32) Fatal: Syntax error, ")" expected but "," found

Marcos Douglas md at delfire.net
Mon Jul 11 16:36:41 CEST 2011


Error to try compile.

My environment:
-FPC  /branches/fixes_2_4 revision 17973

Path in attachment.

../win -FE. -FUW:/md/dev/freepascal/compiler/2.4.5/rtl/units/i386-win32 -di386 -
dRELEASE -I../objpas ../objpas/objpas.pp
W:/md/dev/freepascal/binutils/ppc386.exe -Ur -Xs -O2 -n -Fi../inc -Fi../i386 -Fi
../win -FE. -FUW:/md/dev/freepascal/compiler/2.4.5/rtl/units/i386-win32 -di386 -
dRELEASE -Fi../objpas/sysutils -Fi../objpas/classes -Fu../i386 -I../objpas -I../
win/wininc -Fu../win/wininc -Fu../win -I../inc -Fu../inc -Fu../objpas buildrtl
sysutils.inc(80,32) Fatal: Syntax error, ")" expected but "," found
Fatal: Compilation aborted
make[7]: *** [buildrtl.ppu] Error 1
make[7]: Leaving directory `W:/md/dev/freepascal/compiler/2.4.5/rtl/win32'
make[6]: *** [win32_all] Error 2
make[6]: Leaving directory `W:/md/dev/freepascal/compiler/2.4.5/rtl'
make[5]: *** [rtl] Error 2
make[5]: Leaving directory `W:/md/dev/freepascal/compiler/2.4.5/compiler'
make[4]: *** [next] Error 2
make[4]: Leaving directory `W:/md/dev/freepascal/compiler/2.4.5/compiler'
make[3]: *** [ppc1.exe] Error 2
make[3]: Leaving directory `W:/md/dev/freepascal/compiler/2.4.5/compiler'
make[2]: *** [cycle] Error 2
make[2]: Leaving directory `W:/md/dev/freepascal/compiler/2.4.5/compiler'
make[1]: *** [compiler_cycle] Error 2
make[1]: Leaving directory `W:/md/dev/freepascal/compiler/2.4.5'
make: *** [build-stamp.i386-win32] Error 2


Marcos Douglas
-------------- next part --------------
A non-text attachment was scrubbed...
Name: sysutils_rev17973.patch
Type: application/octet-stream
Size: 402 bytes
Desc: not available
URL: <http://lists.freepascal.org/pipermail/fpc-pascal/attachments/20110711/edc48d75/attachment.obj>

More information about the fpc-pascal mailing list