[fpc-pascal] Building SVN on Mac OS X 10.5.8 intel

Roland Turcan konf at rotursoft.sk
Thu Dec 3 14:45:17 CET 2009

Hello FPC-Pascal users discussions!

I am not able to build SVN 14295.

/Users/test/lazarus/fpcsrc/compiler/ppc386 -XX -CX -Ur -Xs -O2 -n -Fu/Users/test/lazarus/fpcsrc/rtl/units/i386-darwin -Fu/Users/test/lazarus/fpcsrc/packages/univint/units/i386-darwin -FE. -FUunits/i386-darwin -di386 -dRELEASE src/CocoaAll.pas
Foundation.inc(7,2) Fatal: Can't open include file "NSAffineTransform.inc"
Fatal: Compilation aborted
make[4]: *** [CocoaAll.ppu] Error 1
make[3]: *** [fpc_smart] Error 2
make[2]: *** [cocoaint_smart] Error 2
make[1]: *** [packages_smart] Error 2
make: *** [build-stamp.i386-darwin] Error 2

What could be wrong?

Thanks in advance.

Best regards, TRoland

More information about the fpc-pascal mailing list