[fpc-devel] Unknown compilerproc in r 46894

Ryan Joseph genericptr at gmail.com
Sat Sep 19 04:23:26 CEST 2020

I was just going to test the applied patch https://bugs.freepascal.org/view.php?id=36909 with revision 46894 and I got this error. Any ideas?

/usr/local/lib/fpc/3.0.4/ppcx64 -Ur -Xs -O2 -n -Fux86_64 -Fusystems -Fu/Users/ryanjoseph/Developer/fpc/rtl/units/x86_64-darwin -Fix86_64 -FEx86_64/bin/x86_64-darwin -FUx86_64/units/x86_64-darwin -dRELEASE -XR/Applications/Xcode.app/Contents/Developer/Platforms/MacOSX.platform/Developer/SDKs/MacOSX.sdk   -dx86_64 -dGDB -dBROWSERLOG -Fux86 -Fix86 pp.pas
optdfa.pas(342,20) Fatal: Unknown compilerproc "fpc_dynarray_copy". Check if you use the correct run time library.
Fatal: Compilation aborted
make[5]: *** [ppcx64] Error 1
make[4]: *** [next] Error 2
make[3]: *** [ppc1] Error 2
make[2]: *** [cycle] Error 2
make[1]: *** [compiler_cycle] Error 2
make: *** [build-stamp.x86_64-darwin] Error 2

	Ryan Joseph

More information about the fpc-devel mailing list