[fpc-devel] Arm Hardfloat

Den Jean Den.Jean at telenet.be
Thu Oct 4 23:55:00 CEST 2012

On Thursday 04 October 2012 23:18:43 Thomas Schatzl wrote:
> Just checked, processor info (-Cparmv7a) is not passed to the assembler.
> Try "-Cparmv7" - only then --march=armv7-a is passed correctly

but make still fails 

/home/jan/svn/fpc/compiler/ppcarm src/fpmkunit.pp -n -Fu/home/jan/svn/fpc/rtl/units/arm-linux -Fu/home/jan/svn/fpc/packages/paszlib -Fu/home/jan/svn/fpc/packages/fcl-process -Fu/home/jan/svn/fpc/packages/hash -FUunits_bs/arm-linux -Fu../paszlib/src -Fu../hash/src -Fi../paszlib/src  -Fi../fcl-process/src/unix -Fu../fcl-process/src -Fi../fcl-process/src/linux -Fi../fcl-process/src/dummy -dFPC_ARMHF -Aas -O- -CaEABIHF -CfVFPV3_D16 -Cparmv7
make[3]: Leaving directory `/home/jan/svn/fpc/packages/fpmkunit'
/home/jan/svn/fpc/compiler/ppcarm fpmake.pp -n -Fu/home/jan/svn/fpc/packages/fpmkunit/units_bs/arm-linux -Fu/home/jan/svn/fpc/rtl/units/arm-linux  -dFPC_ARMHF -Aas -O- -CaEABIHF -CfVFPV3_D16 -Cparmv7
fpmake.pp(34) Error: Can't call the assembler, error -9 switching to external assembling
fpmake.pp(34) Fatal: There were 2 errors compiling module, stopping
Fatal: Compilation aborted
make[2]: *** [fpmake] Error 1
make[2]: Leaving directory `/home/jan/svn/fpc/packages'
make[1]: *** [packages_smart] Error 2
make[1]: Leaving directory `/home/jan/svn/fpc'
make: *** [build-stamp.arm-linux] Error 2

More information about the fpc-devel mailing list