[fpc-devel] fcl-WEB build broken => AGAIN

Martin lazarus at mfriebe.de
Fri Jun 10 21:54:28 CEST 2011

Everytime I update, lately I run into issues....

problem is th "/" which is not regognized by windows.

windows believes "." is the command.

make.exe -C fcl-web smart
make.exe[3]: Entering directory `C:/FPC/SVN/trunc/packages/fcl-web'
C:/FPC/SVN/trunc/compiler/ppc386.exe fpmake.pp  
./fpmake.exe build --localunitdir=../.. --globalunitdir=.. --os=win32 
--cpu=i386 -o -XX -o -CX -o -Ur -o -Xs -o -O2 -o -n -o -O2 -o -FuC:/FP
C/SVN/trunc/rtl/units/i386-win32 -o 
-FuC:/FPC/SVN/trunc/packages/hash/units/i386-win32 -o 
n32 -o -FuC:/FPC/SVN/trunc/packages/fcl-process/units/i386-win32 -o 
-FuC:/FPC/SVN/trunc/packages/fpmkunit/units/i386-win32 -o -FE. -o -FUuni
ts/i386-win32 -o -gl -o -O3 -o -Or -o -CpPENTIUMM -o -OpPENTIUMM -o 
-di386 -o -dRELEASE --compiler=C:/FPC/SVN/trunc/compiler/ppc386.exe -o "
-XX -CX"
'.' is not recognized as an internal or external command,
operable program or batch file.
make.exe[3]: *** [smart] Error 1
make.exe[3]: Leaving directory `C:/FPC/SVN/trunc/packages/fcl-web'
make.exe[2]: *** [fcl-web_smart] Error 2
make.exe[2]: Leaving directory `C:/FPC/SVN/trunc/packages'
make.exe[1]: *** [packages_smart] Error 2
make.exe[1]: Leaving directory `C:/FPC/SVN/trunc'
make.exe: *** [build-stamp.i386-win32] Error 2

More information about the fpc-devel mailing list