[fpc-devel] Changes in Makefile-system

de_jean_7777 de_jean_7777 at yahoo.com
Sun Apr 3 19:24:57 CEST 2011

When trying to build FPC from svn on a win32 system (win7 and xp) on 
three different systems I get the same error. I'm using a 2.5.1 compiler 
to build fpc from svn.

make -C fcl-web smart
make[3]: Entering directory `C:/Programming/fpc/packages/fcl-web'
C:/Programming/fpc/compiler/ppc386.exe fpmake.pp -Ur -Xs -O2 -n 
s/i386-win32 -FE. -FUunits/i386-win32 -di386 -dRELEASE
./fpmake build --localunitdir=../.. --globalunitdir=.. --os=win32 
--cpu=i386 -o
-Ur -o -Xs -o -O2 -o -n -o -FuC:/Programming/fpc/rtl/units/i386-win32 -o 
rogramming/fpc/packages/hash/units/i386-win32 -o 
paszlib/units/i386-win32 -o 
6-win32 -o -FuC:/Programming/fpc/packages/fpmkunit/units/i386-win32 -o 
-FE. -o -
FUunits/i386-win32 -o -di386 -o -dRELEASE 
/ppc386.exe -o "-XX -CX"
'.' is not recognized as an internal or external command,
operable program or batch file.
make[3]: *** [smart] Error 1
make[3]: Leaving directory `C:/Programming/fpc/packages/fcl-web'
make[2]: *** [fcl-web_smart] Error 2
make[2]: Leaving directory `C:/Programming/fpc/packages'
make[1]: *** [packages_smart] Error 2
make[1]: Leaving directory `C:/Programming/fpc'
make: *** [build-stamp.i386-win32] Error 2

More information about the fpc-devel mailing list