[fpc-devel] fpc-svn177-units-Mysql broken

Jan Ruzicka jan.ruzicka at comcast.net
Fri Jun 3 06:17:09 CEST 2005


the latest version (177) of fpc in svn does not compile on Mac OS X 

The make all ends with following:

/Users/j/fpc/fpc-svn/compiler/ppcppc -Xs -O1 -n -S2 
-Fu/Users/j/fpc/fpc-svn/packages/base/sqlite/units/powerpc-darwin -FE. 
-FU/Users/j/fpc/fpc-svn/fcl/units/powerpc-darwin -dpowerpc -dRELEASE 
dataset.inc(468,54) Error: Incompatible type for arg no. 1: Got 
"TDateTimeAlias", expected "Int64"
db.pp(2025) Fatal: There were 1 errors compiling module, stopping
db.pp(2025) Error: Compilation aborted
make[3]: *** [db.ppu] Error 1
make[2]: *** [db_all] Error 2
make[1]: *** [fcl_all] Error 2
make: *** [build-stamp.powerpc-darwin] Error 2


More information about the fpc-devel mailing list