[fpc-devel]Compilation of today's CVS

Christopher Kirkpatrick chris.kirkpatrick at doctors.org.uk
Tue Jun 22 20:58:14 CEST 2004

During compilation of today's CVS:
Following 'make clean', then 'make all',

many many lines of successful compilation

/home/kirkpatc/FreePascal/fpc/compiler/ppc386 -Xs -OG2p3 -n -Sg
-Fu/home/kirkpatc/FreePascal/fpc/rtl/linux -di386 -dRELEASE pyacc.pas
make[3]: Leaving directory `/home/kirkpatc/FreePascal/fpc/utils/tply'
make -C h2pas all
make[3]: Entering directory `/home/kirkpatc/FreePascal/fpc/utils/h2pas'
/home/kirkpatc/FreePascal/fpc/compiler/ppc386 -Xs -OG2p3 -n -Sg
-Fu/home/kirkpatc/FreePascal/fpc/rtl/linux -di386 -dRELEASE h2pas.pas
h2pas.pas(2498,33) Error: identifier idents no member "I"
h2pas.pas(2498,33) Error: Expression must be constructor call
h2pas.pas(2498,33) Fatal: Syntax error, ")" expected but "end of file"
make[3]: *** [h2pas] Error 1
make[3]: Leaving directory `/home/kirkpatc/FreePascal/fpc/utils/h2pas'
make[2]: *** [h2pas_all] Error 2
make[2]: Leaving directory `/home/kirkpatc/FreePascal/fpc/utils'
make[1]: *** [utils_all] Error 2
make[1]: Leaving directory `/home/kirkpatc/FreePascal/fpc'
make: *** [build-stamp.linux] Error 2
kirkpatc at anglican:~/FreePascal/fpc>

What's going wrong?  Does it matter?

Regards - Chris

Christopher Kirkpatrick <chris.kirkpatrick at doctors.org.uk>

More information about the fpc-devel mailing list